{"text_format":"1","workbook":"xlsx","n_sheets":4,"sheets":["基本情報","基本情報2","list","改版履歴"],"not_rendered":{"charts":0,"images":1,"macros":1,"external_links":0,"defined_names":101,"comments":0,"pivot_tables":0},"unopened":[],"bounds":{"document_bytes":16777216,"sheet_cells":100000,"rows_first":2000,"rows_last":500,"rows_between":2000,"halvings":0,"cell_chars":16384,"cell_head_chars":4096},"cells_cut":0,"cells_raw":0,"read":"whole","date_system":"1900"}

{"sheet":"基本情報","index":0,"n_rows":92,"n_cols":62,"rows_kept":92,"cut":false,"hidden":false,"merged":[[4,1,5,51],[12,1,12,51],[6,1,7,51],[8,1,9,51],[10,1,10,51],[78,0,78,51],[86,0,86,51],[3,0,3,51],[14,0,14,51],[29,13,29,32],[30,13,30,32],[31,13,31,32],[17,0,17,12],[18,0,18,12],[21,0,21,12],[24,0,24,12],[26,0,26,12],[23,0,23,51],[19,13,19,32],[20,13,20,32],[19,6,19,12],[19,0,20,5],[20,6,20,12],[18,13,18,32],[21,13,21,32],[24,13,24,32],[15,0,15,51],[36,13,36,32],[37,13,37,32],[27,0,27,12],[28,0,28,51],[29,0,32,5],[32,6,32,12],[31,6,31,12],[27,42,27,51],[26,38,27,41],[27,13,27,37],[26,13,26,37],[16,0,16,12],[34,0,37,5],[34,6,34,12],[35,6,35,12],[36,6,36,12],[30,6,30,12],[29,6,29,12],[33,0,33,51],[25,0,25,51],[32,13,32,32],[59,0,60,5],[68,33,68,51],[64,6,64,12],[65,6,65,12],[70,0,70,12],[73,0,73,12],[74,0,74,12],[76,0,76,12],[72,0,72,51],[73,13,73,32],[74,13,74,32],[75,13,75,32],[76,13,76,32],[73,33,73,51],[74,33,74,51],[75,33,75,51],[75,0,75,12],[61,0,68,5],[59,33,59,51],[1,40,1,43],[1,27,1,30],[16,13,16,32],[17,13,17,32],[79,6,79,12],[66,8,66,12],[67,8,67,12],[68,8,68,12],[66,6,68,7],[69,0,69,51],[47,13,47,32],[2,0,2,51],[43,13,43,32],[40,33,40,51],[41,33,41,51],[42,33,42,51],[43,33,43,51],[47,33,47,51],[48,33,48,51],[49,33,49,51],[52,33,52,51],[48,13,48,32],[49,13,49,32],[50,13,50,32],[84,6,84,12],[80,6,80,12],[83,6,83,12],[82,6,82,12],[81,6,81,12],[70,13,70,51],[61,6,61,12],[62,6,62,12],[63,6,63,12],[46,0,46,12],[44,0,44,51],[46,13,46,32],[46,33,46,51],[54,13,54,32],[55,6,55,12],[56,6,56,12],[55,0,56,5],[45,0,45,51],[51,13,51,32],[52,13,52,32],[53,13,53,32],[54,6,54,12],[48,0,54,5],[48,6,48,12],[49,6,49,12],[50,6,50,12],[51,6,51,12],[52,6,52,12],[53,6,53,12],[56,33,56,51],[50,33,50,51],[91,13,91,32],[16,33,16,51],[17,33,17,51],[18,33,18,51],[21,33,21,51],[24,33,24,51],[29,33,29,51],[30,33,30,51],[31,33,31,51],[32,33,32,51],[34,33,34,51],[35,33,35,51],[84,13,84,32],[85,13,85,32],[87,13,87,32],[88,13,88,32],[57,0,57,51],[59,6,59,12],[60,6,60,12],[55,13,55,32],[56,13,56,32],[59,13,59,32],[60,13,60,32],[47,0,47,12],[42,6,42,12],[43,6,43,12],[39,0,43,5],[39,13,39,32],[40,13,40,32],[41,13,41,32],[42,13,42,32],[37,6,37,12],[38,0,38,51],[39,6,39,12],[40,6,40,12],[41,6,41,12],[34,13,34,32],[35,13,35,32],[26,42,26,51],[1,44,1,51],[1,31,1,39],[89,33,89,51],[90,33,90,51],[36,33,36,51],[37,33,37,51],[19,33,19,51],[20,33,20,51],[39,33,39,51],[61,33,61,51],[62,33,62,51],[53,33,53,51],[54,33,54,51],[89,13,89,32],[79,13,79,32],[80,13,80,32],[81,13,81,32],[82,13,82,32],[63,33,63,51],[64,33,64,51],[55,33,55,51],[91,33,91,51],[83,33,83,51],[84,33,84,51],[85,33,85,51],[87,33,87,51],[88,33,88,51],[76,33,76,51],[79,33,79,51],[80,33,80,51],[81,33,81,51],[82,33,82,51],[90,13,90,32],[83,13,83,32],[64,13,64,32],[65,13,65,32],[66,13,66,32],[67,13,67,32],[68,13,68,32],[51,33,51,51],[60,33,60,51],[61,13,61,32],[62,13,62,32],[63,13,63,32],[65,33,65,51],[66,33,66,51],[67,33,67,51],[58,0,58,51],[79,0,85,5],[87,6,87,12],[87,0,91,5],[88,6,88,12],[89,6,89,12],[90,6,90,12],[91,6,91,12],[85,6,85,12]]}
[null,null,null,null,null,null,null,null,null,null,null,null,null,null,null,null,null,null,null,null,null,null,null,null,null,null,null,null,null,null,null,null,null,null,null,null,null,null,null,null,null,null,null,null,null,null,null,null,null,null,null,{"$f":"CONCATENATE(BG1,BH1,BI1,BJ1)","v":"Ver.1.00A(2020/10/28)"},null,null,"サービス",5,"forBiz Type Com",null,"Ver.","1.00","A","(2020/10/28)"]
[null,null,null,null,null,null,null,null,null,null,null,null,null,null,null,null,null,null,null,null,null,null,null,null,null,null,null,"オーダ管理番号",null,null,null,null,null,null,null,null,null,null,null,null,"オーダ登録番号",null,null,null,null,null,null,null,null,null,null,null,null,null,"異動種別","新設"]
["第６種オープンコンピュータ通信網サービス　契約申込書\nOCN モバイルONE for Biz Type Com"]
[{"$f":"IF(__\\osOpenInfoCsvWishUmuCd=1,\"＜ご利用案内CSV対応版＞\",\"\")","v":""},null,null,null,null,null,null,null,null,null,null,null,null,null,null,null,null,null,null,null,null,null,null,null,null,null,null,null,null,null,null,null,null,null,null,null,null,null,null,null,null,null,null,null,null,null,null,null,null,null,null,null,null,null,"開案CSVフラグ",2]
["レ","NTTコミュニケーションズ株式会社の定める｢IP通信網サービス契約約款（https://www.ntt.com/about-us/disclosure/tariff/yakkan/ip.html）｣｢重要事項に関する説明｣｢各種利用規約｣の内容について承諾の上、下記のとおり申し込みます｡個人情報の取扱いについては、「プライバシーポリシー（https://www.ntt.com/about-us/hp/privacy.html）」の内容を承諾します。"]
[]
["レ","OCN モバイルONE for Biz Type Comは常時高トラフィックが発生するようなご利用には適しません。デジタルサイネージ・Web会議のように、常時高トラフィックを必要とする利用方法で、他のお客様の通信に支障が出る利用をされる場合には、OCN モバイルONE for Biz Type Comの利用をご遠慮いただく場合があります。"]
[]
["レ","お客さまは、本サービスで提供するアプリケーション及びアプリケーションに使用されている技術（以下アプリケーション等）を、直接的であれ間接的であれ、海外に輸出若しくは持ち出す場合又は日本国の非居住者に譲渡、貸与若しくは提供する場合は、外為法等及び米国輸出管理規則を遵守するものとし、適正な政府の許可を取得する等の適切な手続きを行うものとします。"]
[]
["レ","お客さまは、アプリケーション等を外為法等に定める核兵器を含む大量破壊兵器、通常兵器等の開発、製造、使用のために利用しないものとします。"]
[]
[null,"※必ずチェックを入れてください。チェックがない場合はお申込みいただけません。"]
[]
["お申込情報"]
["■ご注意\n※お申込み後の取り消しはできません。またお客様番号払出し後(ご利用開始希望日の概ね5営業日前)にお申込み内容の変更はできません。"]
["お申込種別（必須）",null,null,null,null,null,null,null,null,null,null,null,null,"新設",null,null,null,null,null,null,null,null,null,null,null,null,null,null,null,null,null,null,null,"※OCN モバイルONE for Biz Type Comは「新設」固定となります。\n※回線追加はビジネスポータルからお申込みください。\n　 ビジネスポータルは、開通日の翌々営業日よりご利用いただけます。"]
["お申込年月日（必須）",null,null,null,null,null,null,null,null,null,null,null,null,null,null,null,null,null,null,null,null,null,null,null,null,null,null,null,null,null,null,null,null,"YYYY/MM/DD（半角）"]
["開通希望年月日（必須）",null,null,null,null,null,null,null,null,null,null,null,null,null,null,null,null,null,null,null,null,null,null,null,null,null,null,null,null,null,null,null,null,"YYYY/MM/DD（半角）\n※ご利用開始希望日には、申込みいただく日付から5営業日目以降の土日祝日を除く日付を記入いただきます。\n※ 申込内容に不備等があった場合には、ご利用開始希望日の延期をお願いする場合がございますので、ご了承ください。\n※手続き上、お客様のご利用開始希望日に添えない場合があります。"]
["お申込サービス",null,null,null,null,null,"認証方式\n（必須）",null,null,null,null,null,null,"共通ID",null,null,null,null,null,null,null,null,null,null,null,null,null,null,null,null,null,null,null,"※OCN モバイルONE for Biz Type Comは「共通ID」固定となります。"]
[null,null,null,null,null,null,"サービスメニュー\n（必須）",null,null,null,null,null,null,"総量規制サービス",null,null,null,null,null,null,null,null,null,null,null,null,null,null,null,null,null,null,null,"※OCN モバイルONE for Biz Type Comは「総量規制サービス」固定となります。",null,null,null,null,null,null,null,null,null,null,null,null,null,null,null,null,null,null,null,null,null,null,"サービスメニュー\n【リスト】","serviceMenu_1"]
["お客さま番号（記入不要）",null,null,null,null,null,null,null,null,null,null,null,null,null,null,null,null,null,null,null,null,null,null,null,null,null,null,null,null,null,null,null,null,"記入不要（NTT-Com使用欄）"]
[]
["共通顧客ID"]
["共通顧客ID（必須）",null,null,null,null,null,null,null,null,null,null,null,null,null,null,null,null,null,null,null,null,null,null,null,null,null,null,null,null,null,null,null,null,"半角大文字C＋半角数字10桁で記入してください。"]
["ご契約者名"]
["フリガナ（必須）",null,null,null,null,null,null,null,null,null,null,null,null,null,null,null,null,null,null,null,null,null,null,null,null,null,null,null,null,null,null,null,null,null,null,null,null,null,null,null,null,null,"全角35桁以内"]
["ご契約者名（必須）",null,null,null,null,null,null,null,null,null,null,null,null,null,null,null,null,null,null,null,null,null,null,null,null,null,null,null,null,null,null,null,null,null,null,null,null,null,null,null,null,null,"全角40桁以内\n※正式名称を40文字以内でご記入いただきますが、弊社の都合により、名称を省略させていただくことがありますので、ご了承ください。"]
["ご契約者住所"]
["ご契約者住所",null,null,null,null,null,"郵便番号（必須）",null,null,null,null,null,null,null,null,null,null,null,null,null,null,null,null,null,null,null,null,null,null,null,null,null,null,"半角数字7桁固定"]
[null,null,null,null,null,null,"ご住所（必須）",null,null,null,null,null,null,null,null,null,null,null,null,null,null,null,null,null,null,null,null,null,null,null,null,null,null,"全角46桁以内\n※住所を都道府県からご記入ください。"]
[null,null,null,null,null,null,"番地等（必須）",null,null,null,null,null,null,null,null,null,null,null,null,null,null,null,null,null,null,null,null,null,null,null,null,null,null,"全角20桁以内"]
[null,null,null,null,null,null,"ビル名等",null,null,null,null,null,null,null,null,null,null,null,null,null,null,null,null,null,null,null,null,null,null,null,null,null,null,"全角20桁以内"]
["事務担当者＜お申込みに関するご連絡先＞"]
["事務担当者",null,null,null,null,null,"部課名",null,null,null,null,null,null,null,null,null,null,null,null,null,null,null,null,null,null,null,null,null,null,null,null,null,null,"全角20桁以内"]
[null,null,null,null,null,null,"担当者名（必須）",null,null,null,null,null,null,null,null,null,null,null,null,null,null,null,null,null,null,null,null,null,null,null,null,null,null,"全角10桁以内"]
[null,null,null,null,null,null,"電話番号（必須）",null,null,null,null,null,null,null,null,null,null,null,null,null,null,null,null,null,null,null,null,null,null,null,null,null,null,"ハイフンを含む半角10桁～13桁\n（数字、ハイフンのみ）"]
[null,null,null,null,null,null,"e-mail（必須）",null,null,null,null,null,null,null,null,null,null,null,null,null,null,null,null,null,null,null,null,null,null,null,null,null,null,"半角英数64桁以内\n※ご契約に関する連絡用として、既存のメールアドレスをご記入ください。\n※ご担当者が複数の場合は、カンマで区切りで記入ください。\n※メールアドレスをお持でない方は「a@a」をご記入ください。"]
["技術担当者情報"]
["技術担当者",null,null,null,null,null,"コピーリスト（必須）",null,null,null,null,null,null,null,null,null,null,null,null,null,null,null,null,null,null,null,null,null,null,null,null,null,null,"選択してください",null,null,null,null,null,null,null,null,null,null,null,null,null,null,null,null,null,null,null,null,"技術担当者コピーリスト\n【条件付き書式】",{"$f":"OR($N$40=\"\",$N$40=\"次のとおり\")","v":true}]
[null,null,null,null,null,null,"担当者名（必須）",null,null,null,null,null,null,null,null,null,null,null,null,null,null,null,null,null,null,null,null,null,null,null,null,null,null,"全角10桁以内"]
[null,null,null,null,null,null,"電話番号（必須）",null,null,null,null,null,null,null,null,null,null,null,null,null,null,null,null,null,null,null,null,null,null,null,null,null,null,"ハイフンを含む半角10桁～13桁\n（数字、ハイフンのみ）"]
[null,null,null,null,null,null,"FAX番号",null,null,null,null,null,null,null,null,null,null,null,null,null,null,null,null,null,null,null,null,null,null,null,null,null,null,"ハイフンを含む半角10桁～13桁\n（数字、ハイフンのみ）"]
[null,null,null,null,null,null,"e-mail（必須）",null,null,null,null,null,null,null,null,null,null,null,null,null,null,null,null,null,null,null,null,null,null,null,null,null,null,"半角英数64桁以内\n※ご担当者が複数の場合は、カンマで区切りで記入ください。\n※メールアドレスをお持ちでない方は「a@a」をご記入ください。"]
["お支払に関する情報",null,null,null,null,null,null,null,null,null,null,null,null,null,null,null,null,null,null,null,null,null,null,null,null,null,null,null,null,null,null,null,null,null,null,null,null,null,null,null,null,null,null,null,null,null,null,null,null,null,null,null,null,null,"請求情報カテゴリ\n【条件付き書式】",{"$f":"$N$17<>\"端末追加\"","v":true}]
["■ご注意\n【口座振替及びクレジットカードでのお支払】をご希望のお客さま\n　※「請求書によるお支払」をご選択いただき、ビリングカスタマセンタ（TEL：0120-047128）までご連絡下さい。\n　　弊社より口座振替によるお支払をご希望のお客さまは「口座振替依頼書」、クレジットカードでのお支払をご希望のお客さまは「クレジットカード払い申込書」を送付いたします。\n　※初回のご請求は「請求書によるお支払」になる場合があります。\n\n【既契約のお支払情報と同一にする】をご希望のお客さま\n　※引継ぎ元の請求がファイナンス社の場合は対象外となります。\n　※OCN利用料をフレッツ光利用料と合わせて、お支払いただいているお客さまはご利用いただけません。\n　※現在、ご利用中のサービスのお支払情報と同一にします。（但し、ご契約者名義が同一の場合のみ）\n　※複数の請求を一枚にまとめている場合もお支払情報を同一にします。\n　※お支払情報に関するお知らせの送付先は既契約と同一になります。"]
["支払方法（必須）",null,null,null,null,null,null,null,null,null,null,null,null,null,null,null,null,null,null,null,null,null,null,null,null,null,null,null,null,null,null,null,null,"選択してください"]
["既契約のお客さま番号\n（既契約のお支払情報と同一にする）（必須）",null,null,null,null,null,null,null,null,null,null,null,null,null,null,null,null,null,null,null,null,null,null,null,null,null,null,null,null,null,null,null,null,"ＨまたはＮからはじまる10桁のお客さま番号をご記入ください。",null,null,null,null,null,null,null,null,null,null,null,null,null,null,null,null,null,null,null,null,"既契約のお客さま番号\n【条件付き書式】",{"$f":"$N$47<>\"請求書によるお支払\"","v":true}]
["毎月の利用料の\n請求先",null,null,null,null,null,"コピーリスト（必須）",null,null,null,null,null,null,null,null,null,null,null,null,null,null,null,null,null,null,null,null,null,null,null,null,null,null,"選択してください",null,null,null,null,null,null,null,null,null,null,null,null,null,null,null,null,null,null,null,null,"請先コピーリスト\n【条件付き書式】",{"$f":"$N$47<>\"既契約のお支払情報と同一にする\"","v":true}]
[null,null,null,null,null,null,"郵便番号（必須）",null,null,null,null,null,null,null,null,null,null,null,null,null,null,null,null,null,null,null,null,null,null,null,null,null,null,"半角数字7桁固定",null,null,null,null,null,null,null,null,null,null,null,null,null,null,null,null,null,null,null,null,"請先\n郵便番号～ビル名\n【条件付き書式】",{"$f":"AND($BD$49=TRUE,OR($N$49=\"次のとおり\",$N$49=\"\"))","v":true}]
[null,null,null,null,null,null,"ご住所（必須）",null,null,null,null,null,null,null,null,null,null,null,null,null,null,null,null,null,null,null,null,null,null,null,null,null,null,"全角46桁以内\n※住所を都道府県からご記入ください。"]
[null,null,null,null,null,null,"番地等（必須）",null,null,null,null,null,null,null,null,null,null,null,null,null,null,null,null,null,null,null,null,null,null,null,null,null,null,"全角20桁以内"]
[null,null,null,null,null,null,"ビル名等",null,null,null,null,null,null,null,null,null,null,null,null,null,null,null,null,null,null,null,null,null,null,null,null,null,null,"全角20桁以内"]
[null,null,null,null,null,null,"宛先　お名前フリガナ\n（必須）",null,null,null,null,null,null,null,null,null,null,null,null,null,null,null,null,null,null,null,null,null,null,null,null,null,null,"全角30桁以内",null,null,null,null,null,null,null,null,null,null,null,null,null,null,null,null,null,null,null,null,"請先宛先/連絡先\n【条件付き書式】",{"$f":"$N$47<>\"既契約のお支払情報と同一にする\"","v":true}]
[null,null,null,null,null,null,"宛先　お名前\n（必須）",null,null,null,null,null,null,null,null,null,null,null,null,null,null,null,null,null,null,null,null,null,null,null,null,null,null,"全角20桁以内\n※宛先に記入いただいた内容は、そのまま請求書に印刷されます。会社名・部署名・氏名等をご記入ください。　"]
["請求に関する連絡先",null,null,null,null,null,"お名前",null,null,null,null,null,null,null,null,null,null,null,null,null,null,null,null,null,null,null,null,null,null,null,null,null,null,"全角10桁以内\n※請求書の宛先には表示されません。"]
[null,null,null,null,null,null,"電話番号",null,null,null,null,null,null,null,null,null,null,null,null,null,null,null,null,null,null,null,null,null,null,null,null,null,null,"ハイフンを含む半角10桁～13桁\n（数字、ハイフンのみ）"]
["ご利用案内に関する情報　　　　※接続に必要となる情報をOCNより送付します。"]
["■ご注意\n※「ご利用内容のご案内」メールは、「customer@info.ocn.ne.jp」から届きますので、メール受信設定いただきますようお願いいたします。\n※「ご利用内容のご案内」は、メールにて送信されるURLから専用サイトへアクセスし、確認パスワードを入力することで、閲覧/保存出来ます。\n※メールにてお届けできない場合の送付先に関しても必ずご記入下さい。\n※送信したメールが届かなかった場合は、郵送にてお送りいたしますが、開通日に間に合わない場合がありますので、ご注意願います。"]
["ご利用案内の送信先",null,null,null,null,null,"送信先メールアドレス\n（必須）",null,null,null,null,null,null,null,null,null,null,null,null,null,null,null,null,null,null,null,null,null,null,null,null,null,null,"半角英数64桁以内\n※メールアドレスをお持ちでない場合は、記入不要です。(郵送にて送付いたします)\n※複数のメールアドレスを指定することはできません。複数アドレスを指定する場合は、メーリングリストにてお申込ください。\n※携帯電話のメールアドレスは指定できません。"]
{"$rows_left_out":33}
{"sheet":"基本情報2","index":1,"n_rows":20,"n_cols":58,"rows_kept":20,"cut":false,"hidden":false,"merged":[[4,0,4,51],[6,14,6,28],[5,13,5,32],[5,33,5,51],[6,33,10,51],[6,0,7,12],[8,0,10,12],[8,30,8,32],[7,30,7,32],[7,14,7,28],[8,14,8,28],[9,14,9,28],[10,14,10,28],[9,30,9,32],[5,0,5,12],[19,8,19,12],[15,6,15,12],[12,33,12,51],[13,13,13,32],[13,33,13,51],[13,6,13,12],[14,6,14,12],[12,6,12,12],[16,33,16,51],[16,6,19,7],[19,13,19,32],[19,33,19,51],[14,13,14,32],[14,33,14,51],[15,13,15,32],[15,33,15,51],[16,13,16,32],[1,0,2,51],[17,13,17,32],[17,33,17,51],[18,13,18,32],[18,33,18,51],[12,13,12,32],[6,30,6,32],[11,33,11,51],[16,8,16,12],[17,8,17,12],[18,8,18,12],[11,13,11,32],[11,0,19,5],[11,6,11,12],[10,30,10,32]]}
[null,null,null,null,null,null,null,null,null,null,null,null,null,null,null,null,null,null,null,null,null,null,null,null,null,null,null,null,null,null,null,null,null,null,null,null,null,null,null,null,null,null,null,null,null,null,null,null,null,null,null,{"$f":"基本情報!$AZ$1","v":"Ver.1.00A(2020/10/28)"}]
[{"$f":"基本情報!$A$3","v":"第６種オープンコンピュータ通信網サービス　契約申込書\nOCN モバイルONE for Biz Type Com"}]
[]
[]
["付加サービス情報"]
["料金明細利用有無（必須）",null,null,null,null,null,null,null,null,null,null,null,null,null,null,null,null,null,null,null,null,null,null,null,null,null,null,null,null,null,null,null,null,"※webでの料金明細確認をご希望される場合は「利用する」を、ご希望されない場合は「利用しない」を選択してください。",null,null,null,null,null,null,null,null,null,null,null,null,null,null,null,null,null,null,null,null,"料金明細利用有無\n【条件付き書式】",{"$f":"基本情報!$N$17<>\"端末追加\"","v":true}]
["料金明細サイト閲覧用グローバルＩＰアドレス",null,null,null,null,null,null,null,null,null,null,null,null,1,null,null,null,null,null,null,null,null,null,null,null,null,null,null,null,"/",null,null,null,"※セキュリティ上、お客様が指定されたグローバルIPアドレスのみアクセスを許容するため、必ずご指定願います。\n※固定しない場合（IPアドレスフリーの場合）は、アクセス元グローバルIPアドレスに「0.0.0.0/0」をご記入ください。",null,null,null,null,null,null,null,null,null,null,null,null,null,null,null,null,null,null,null,null,"料金明細用IPアドレス\n【条件付き書式】",{"$f":"AND(基本情報!$N$17<>\"端末追加\",$N$6<>\"利用しない\")","v":true}]
[null,null,null,null,null,null,null,null,null,null,null,null,null,2,null,null,null,null,null,null,null,null,null,null,null,null,null,null,null,"/"]
[null,null,null,null,null,null,null,null,null,null,null,null,null,3,null,null,null,null,null,null,null,null,null,null,null,null,null,null,null,"/"]
[null,null,null,null,null,null,null,null,null,null,null,null,null,4,null,null,null,null,null,null,null,null,null,null,null,null,null,null,null,"/"]
[null,null,null,null,null,null,null,null,null,null,null,null,null,5,null,null,null,null,null,null,null,null,null,null,null,null,null,null,null,"/"]
["料金明細サイト閲覧用\nID/パスワード\n通知送付先",null,null,null,null,null,"コピーリスト（必須）",null,null,null,null,null,null,null,null,null,null,null,null,null,null,null,null,null,null,null,null,null,null,null,null,null,null,"選択してください",null,null,null,null,null,null,null,null,null,null,null,null,null,null,null,null,null,null,null,null,"ID/PW通知先ｺﾋﾟｰﾘｽﾄ\n【条件付き書式】",{"$f":"AND(基本情報!$N$17<>\"端末追加\",$N$6<>\"利用しない\")","v":true},"ID/PW通知先ｺﾋﾟｰﾘｽﾄ\n【リスト】",{"$f":"IF(AND(基本情報!$N$49=\"次のとおり\",基本情報!$N$62=\"次のとおり\"),\"MeisaiAddressCopylist_1\",IF(AND(基本情報!$N$49=\"次のとおり\",基本情報!$N$62<>\"次のとおり\"),\"MeisaiAddressCopylist_2\",IF(AND(基本情報!$N$49<>\"次のとおり\",基本情報!$N$62=\"次のとおり\"),\"MeisaiAddressCopylist_3\",IF(AND(基本情報!$N$49<>\"次のとおり\",基本情報!$N$62<>\"次のとおり\"),\"MeisaiAddressCopylist_4\",\"null\"))))","v":"MeisaiAddressCopylist_4"}]
[null,null,null,null,null,null,"郵便番号（必須）",null,null,null,null,null,null,null,null,null,null,null,null,null,null,null,null,null,null,null,null,null,null,null,null,null,null,"半角数字7桁固定",null,null,null,null,null,null,null,null,null,null,null,null,null,null,null,null,null,null,null,null,"ID/PW通知先住所\n【条件付き書式】",{"$f":"AND($BD$12=TRUE,OR($N$12=\"次のとおり\",$N$12=\"\"))","v":true}]
[null,null,null,null,null,null,"ご住所（必須）",null,null,null,null,null,null,null,null,null,null,null,null,null,null,null,null,null,null,null,null,null,null,null,null,null,null,"全角46桁以内\n※住所を都道府県からご記入ください。"]
[null,null,null,null,null,null,"番地等（必須）",null,null,null,null,null,null,null,null,null,null,null,null,null,null,null,null,null,null,null,null,null,null,null,null,null,null,"全角20桁以内"]
[null,null,null,null,null,null,"ビル名等",null,null,null,null,null,null,null,null,null,null,null,null,null,null,null,null,null,null,null,null,null,null,null,null,null,null,"全角20桁以内"]
[null,null,null,null,null,null,"宛先",null,"会社名/お名前\n（必須）",null,null,null,null,null,null,null,null,null,null,null,null,null,null,null,null,null,null,null,null,null,null,null,null,"全角20桁以内",null,null,null,null,null,null,null,null,null,null,null,null,null,null,null,null,null,null,null,null,"ID/PW通知先宛先\n【条件付き書式】",{"$f":"AND(基本情報!$N$17<>\"端末追加\",$N$6<>\"利用しない\")","v":true}]
[null,null,null,null,null,null,null,null,"部課名",null,null,null,null,null,null,null,null,null,null,null,null,null,null,null,null,null,null,null,null,null,null,null,null,"全角20桁以内"]
[null,null,null,null,null,null,null,null,"担当者名\n（必須）",null,null,null,null,null,null,null,null,null,null,null,null,null,null,null,null,null,null,null,null,null,null,null,null,"全角10桁以内"]
[null,null,null,null,null,null,null,null,"電話番号\n（必須）",null,null,null,null,null,null,null,null,null,null,null,null,null,null,null,null,null,null,null,null,null,null,null,null,"ハイフンを含む半角10桁～13桁\n（数字、ハイフンのみ）"]

{"sheet":"list","index":2,"n_rows":50,"n_cols":5,"rows_kept":50,"cut":false,"hidden":true,"merged":[]}
[null,"■リスト値一覧"]
[]
[null,"リスト名","名前定義","リスト値","備考"]
[null,"お申込み種別","ordertype","新設"]
[null,"認証方式","authenticMethod","共通ID","-"]
[null,"サービスメニュー","serviceMenu_1","総量規制サービス"]
[null,"技術担当者連絡先コピーリスト","nwTechnologyCopylist","お申込みに関する連絡先と同じ"]
[null,"技術担当者連絡先コピーリスト","nwTechnologyCopylist","次のとおり"]
[null,"支払方法","paymentOption","請求書によるお支払"]
[null,"支払方法","paymentOption","既契約のお支払情報と同一にする"]
[null,"毎月の利用料の請求先コピーリスト","billMailingCopylist","ご契約者住所と同じ"]
[null,"毎月の利用料の請求先コピーリスト","billMailingCopylist","次のとおり"]
[null,"ご利用案内の送付先コピーリスト","kaianMailingAddressCopylist_1","ご契約者住所と同じ"]
[null,"ご利用案内の送付先コピーリスト","kaianMailingAddressCopylist_1","毎月の利用料の請求先と同じ"]
[null,"ご利用案内の送付先コピーリスト","kaianMailingAddressCopylist_1","次のとおり"]
[null,null,"kaianMailingAddressCopylist_2","ご契約者住所と同じ"]
[null,null,"kaianMailingAddressCopylist_2","次のとおり"]
[null,"ＩＤ/パスワード通知送付先コピーリスト","MeisaiAddressCopylist_1","ご契約者住所と同じ"]
[null,"ＩＤ/パスワード通知送付先コピーリスト","MeisaiAddressCopylist_1","毎月の利用料の請求先と同じ"]
[null,"ＩＤ/パスワード通知送付先コピーリスト","MeisaiAddressCopylist_1","ご利用案内の送付先住所と同じ"]
[null,"ＩＤ/パスワード通知送付先コピーリスト","MeisaiAddressCopylist_1","次のとおり"]
[null,"ＩＤ/パスワード通知送付先コピーリスト","MeisaiAddressCopylist_2","ご契約者住所と同じ"]
[null,"ＩＤ/パスワード通知送付先コピーリスト","MeisaiAddressCopylist_2","毎月の利用料の請求先と同じ"]
[null,"ＩＤ/パスワード通知送付先コピーリスト","MeisaiAddressCopylist_2","次のとおり"]
[null,"ＩＤ/パスワード通知送付先コピーリスト","MeisaiAddressCopylist_3","ご契約者住所と同じ"]
[null,"ＩＤ/パスワード通知送付先コピーリスト","MeisaiAddressCopylist_3","ご利用案内の送付先住所と同じ"]
[null,"ＩＤ/パスワード通知送付先コピーリスト","MeisaiAddressCopylist_3","次のとおり"]
[null,"ＩＤ/パスワード通知送付先コピーリスト","MeisaiAddressCopylist_4","ご契約者住所と同じ"]
[null,"ＩＤ/パスワード通知送付先コピーリスト","MeisaiAddressCopylist_4","次のとおり"]
[null,"付加サービス","option","利用する"]
[null,"付加サービス","option","利用しない"]
[null,"回線種別","customerDivision","法人"]
[null,"回線種別","customerDivision","個人"]
[null,"回線種別","customerDivision","外国公館等"]
[null,"回線種別","customerDivision","国・地方自治体"]
[null,"回線種別","customerDivision","業務用"]
[null,"料金に関する留意事項","individuallyChargeType","相対申込有"]
[null,"料金に関する留意事項","individuallyChargeType","型紙申込有"]
[null,"料金に関する留意事項","individuallyChargeType","無"]
[]
[]
[]
[]
[]
[]
[]
[]
[]
[]
[null,"null","null"]

{"sheet":"改版履歴","index":3,"n_rows":32,"n_cols":9,"rows_kept":32,"cut":false,"hidden":true,"merged":[]}
["改版履歴"]
[null,"No.","更新日","更新者","Ver.","シート名","概要","詳細","備考"]
[null,1,"2020-09-03","石田香織","Ver.1.00A","-","初版",null,"Webエントリリリース：2020/10/28"]
[null,2]
[null,3]
[null,4]
[null,5]
[null,6]
[null,7]
[null,8]
[null,9]
[null,10]
[null,11]
[null,12]
[null,13]
[null,14]
[null,15]
[null,16]
[null,17]
[null,18]
[null,19]
[null,20]
[null,21]
[null,22]
[null,23]
[null,24]
[null,25]
[null,26]
[null,27]
[null,28]
[null,29]
[null,30]